{"text_format":"1","workbook":"xlsx","n_sheets":10,"sheets":["基本情報登録","メイン","入力シート","印刷シート","記入上の注意点","記入例日帰り","記入例②「泊あり」","記入例③「ゆとり出張」","記入例④「変更」","記入例⑤「取り止め」"],"not_rendered":{"charts":0,"images":2,"macros":1,"external_links":0,"defined_names":7,"comments":0,"pivot_tables":0},"unopened":[],"bounds":{"document_bytes":16777216,"sheet_cells":100000,"rows_first":2000,"rows_last":500,"rows_between":2000,"halvings":0,"cell_chars":16384,"cell_head_chars":4096},"cells_cut":0,"cells_raw":0,"read":"whole","date_system":"1900"}

{"sheet":"基本情報登録","index":0,"n_rows":51,"n_cols":11,"rows_kept":51,"cut":false,"hidden":false,"merged":[]}
["学校名","伊野中学校",null,"№","職員番号","職名","氏名","自宅住所",null,"№","交通機関"]
["年度",2,null,1,123456,"校長","○○　○○","高知市本町",null,1,"公用車"]
[null,null,null,2,null,null,null,null,null,2,"借上車"]
[null,null,null,3,null,null,null,null,null,3,"自家用車"]
[null,null,null,4,null,null,null,null,null,4,"自家用車同乗"]
[null,null,null,5,null,null,null,null,null,5,"乗合バス"]
[null,null,null,6,null,null,null,null,null,6,"高速バス"]
[null,null,null,7,null,null,null,null,null,7,"電車"]
[null,null,null,8,null,null,null,null,null,8,"鉄道"]
[null,null,null,9,null,null,null,null,null,9,"船舶"]
{"$rows_left_out":42}
{"sheet":"メイン","index":1,"n_rows":1,"n_cols":4,"rows_kept":1,"cut":false,"hidden":false,"merged":[[4,19,4,25],[5,19,5,25],[6,20,6,26],[7,20,7,26],[8,20,8,27]]}
[null,null,null,"別途旅費作成支援ツール　ver.200601"]

{"sheet":"入力シート","index":2,"n_rows":152,"n_cols":73,"rows_kept":152,"cut":false,"hidden":false,"merged":[]}
[null,2,3,4,5,6,7,8,9,10,11,12,13,14,15,16,17,18,19,20,21,22,23,24,25,26,27,28,29,30,31,32,33,34,35,36,37,38,39,40,41,42,43,44,45,46,47,48,49,50,51,52,53,54,55,56,57,58,59,60,61,62,63,64,65,66,67,68,69,70,71,72,73]
["命令番号","命令簿作成日","用務","場所","職名1","氏名1","職名2","氏名2","職名3","氏名3","出発","帰着","公用車","借上車","自家用車","自家用車同乗","乗合バス","高速バス","電車","鉄道","船舶","航空機","モノレール","空港連絡バス","その他","旅費支給機関","出張日1","出発地","経路","帰着地","泊数","出張日2","出発地","経路","帰着地","泊数","出張日3","出発地","経路","帰着地","泊数","出張日4","出発地","経路","帰着地","泊数","出張日5","出発地","経路","帰着地","泊数","出張日6","出発地","経路","帰着地","泊数","出張日7","出発地","経路","帰着地","泊数","出張日8","出発地","経路","帰着地","泊数","私有車1","同乗1","私有車2","同乗2","私有車3","同乗3","特別承認等"]
[1,"2020-06-01","テスト","テスト2",null,"○○　○○",null,"",null,"","公署","自宅",null,null,1,null,null,null,null,null,null,null,null,null,"","","6/1","学校","","自宅","1","","","","","","","","","","","","","","","","","","","","","","","","","","","","","","","","","","","","使用",null,null,null,null,null,""]
[null,null,null,null,{"$f":"IF(F4=\"\",\"\",INDEX(基本情報登録!F:F,MATCH(入力シート!F4,基本情報登録!G:G,0)))","v":""},"",{"$f":"IF(H4=\"\",\"\",INDEX(基本情報登録!F:F,MATCH(入力シート!H4,基本情報登録!G:G,0)))","v":""},"",{"$f":"IF(J4=\"\",\"\",INDEX(基本情報登録!F:F,MATCH(入力シート!J4,基本情報登録!G:G,0)))","v":""},"",null,null,null,null,null,null,null,null,null,null,null,null,null,null,"","","","","","","","","","","","","","","","","","","","","","","","","","","","","","","","","","","","","","","","","","",null,null,null,null,null,null,""]
[null,null,null,null,{"$f":"IF(F5=\"\",\"\",INDEX(基本情報登録!F:F,MATCH(入力シート!F5,基本情報登録!G:G,0)))","v":""},null,{"$f":"IF(H5=\"\",\"\",INDEX(基本情報登録!F:F,MATCH(入力シート!H5,基本情報登録!G:G,0)))","v":""},null,{"$f":"IF(J5=\"\",\"\",INDEX(基本情報登録!F:F,MATCH(入力シート!J5,基本情報登録!G:G,0)))","v":""}]
[null,null,null,null,{"$f":"IF(F6=\"\",\"\",INDEX(基本情報登録!F:F,MATCH(入力シート!F6,基本情報登録!G:G,0)))","v":""},null,{"$f":"IF(H6=\"\",\"\",INDEX(基本情報登録!F:F,MATCH(入力シート!H6,基本情報登録!G:G,0)))","v":""},null,{"$f":"IF(J6=\"\",\"\",INDEX(基本情報登録!F:F,MATCH(入力シート!J6,基本情報登録!G:G,0)))","v":""}]
[null,null,null,null,{"$f":"IF(F7=\"\",\"\",INDEX(基本情報登録!F:F,MATCH(入力シート!F7,基本情報登録!G:G,0)))","v":""},null,{"$f":"IF(H7=\"\",\"\",INDEX(基本情報登録!F:F,MATCH(入力シート!H7,基本情報登録!G:G,0)))","v":""},null,{"$f":"IF(J7=\"\",\"\",INDEX(基本情報登録!F:F,MATCH(入力シート!J7,基本情報登録!G:G,0)))","v":""}]
[null,null,null,null,{"$f":"IF(F8=\"\",\"\",INDEX(基本情報登録!F:F,MATCH(入力シート!F8,基本情報登録!G:G,0)))","v":""},null,{"$f":"IF(H8=\"\",\"\",INDEX(基本情報登録!F:F,MATCH(入力シート!H8,基本情報登録!G:G,0)))","v":""},null,{"$f":"IF(J8=\"\",\"\",INDEX(基本情報登録!F:F,MATCH(入力シート!J8,基本情報登録!G:G,0)))","v":""}]
[null,null,null,null,{"$f":"IF(F9=\"\",\"\",INDEX(基本情報登録!F:F,MATCH(入力シート!F9,基本情報登録!G:G,0)))","v":""},null,{"$f":"IF(H9=\"\",\"\",INDEX(基本情報登録!F:F,MATCH(入力シート!H9,基本情報登録!G:G,0)))","v":""},null,{"$f":"IF(J9=\"\",\"\",INDEX(基本情報登録!F:F,MATCH(入力シート!J9,基本情報登録!G:G,0)))","v":""}]
[null,null,null,null,{"$f":"IF(F10=\"\",\"\",INDEX(基本情報登録!F:F,MATCH(入力シート!F10,基本情報登録!G:G,0)))","v":""},null,{"$f":"IF(H10=\"\",\"\",INDEX(基本情報登録!F:F,MATCH(入力シート!H10,基本情報登録!G:G,0)))","v":""},null,{"$f":"IF(J10=\"\",\"\",INDEX(基本情報登録!F:F,MATCH(入力シート!J10,基本情報登録!G:G,0)))","v":""}]
{"$rows_left_out":143}
{"sheet":"印刷シート","index":3,"n_rows":62,"n_cols":44,"rows_kept":62,"cut":false,"hidden":false,"merged":[[22,1,23,1],[20,29,20,30],[21,2,21,3],[21,4,21,6],[21,7,21,8],[21,23,21,24],[21,26,21,28],[21,29,21,30],[20,2,20,3],[20,4,20,6],[20,7,20,8],[22,4,23,6],[22,7,23,8],[22,9,23,9],[23,17,23,21],[23,23,23,24],[20,26,20,28],[20,11,25,11],[20,12,21,14],[20,15,21,16],[23,26,25,30],[24,1,26,1],[24,2,26,3],[24,4,26,6],[0,1,0,30],[0,0,40,0],[1,1,1,7],[2,1,2,2],[2,3,2,7],[2,11,2,14],[2,19,2,23],[2,27,2,30],[1,9,1,19],[1,21,1,30],[13,20,14,21],[18,18,18,20],[15,1,16,1],[15,2,16,3],[15,4,16,6],[15,7,16,8],[15,9,16,9],[16,17,16,21],[13,4,13,6],[13,7,13,8],[17,1,19,1],[17,2,19,3],[17,4,19,6],[17,7,19,8],[5,29,5,30],[6,11,11,11],[6,12,7,14],[6,20,7,21],[10,4,12,6],[10,9,12,9],[6,26,6,28],[7,26,7,28],[6,29,6,30],[5,4,5,6],[5,7,5,8],[5,12,5,14],[8,4,9,6],[8,7,9,8],[8,9,9,9],[7,7,7,8],[5,10,26,10],[7,29,7,30],[9,26,11,30],[13,29,13,30],[14,23,14,24],[14,26,14,28],[14,29,14,30],[11,23,11,24],[40,24,40,28],[3,1,3,2],[3,5,3,7],[3,9,3,12],[3,14,3,19],[3,21,3,23],[3,27,3,28],[4,3,4,30],[6,23,6,24],[7,23,7,24],[29,10,29,13],[34,10,34,13],[20,17,21,19],[20,20,21,21],[40,11,40,19],[40,20,40,22],[5,26,5,28],[27,2,27,3],[27,4,27,6],[27,7,27,8],[18,23,18,24],[16,26,18,30],[20,23,20,24],[13,11,18,11],[13,12,14,14],[13,15,14,16],[13,17,14,19],[16,23,16,24],[13,23,13,24],[13,26,13,28],[13,2,13,3],[14,2,14,3],[14,4,14,6],[14,7,14,8],[17,9,19,9],[24,7,26,8],[24,9,26,9],[25,18,25,20],[25,23,25,24],[22,2,23,3],[30,2,30,3],[30,4,30,6],[30,7,30,8],[28,2,28,3],[28,4,28,6],[28,7,28,8],[29,2,29,3],[29,4,29,6],[29,7,29,8],[28,11,28,30],[30,11,33,29],[11,18,11,20],[2,24,2,26],[10,1,12,1],[10,2,12,3],[10,7,12,8],[7,4,7,6],[7,2,7,3],[8,1,9,1],[5,15,5,16],[6,15,7,16],[9,23,9,24],[2,15,2,18],[5,17,5,19],[6,17,7,19],[9,17,9,21],[5,20,5,21],[5,23,5,24],[6,2,6,3],[6,4,6,6],[6,7,6,8],[4,1,4,2],[5,2,5,3],[8,2,9,3]]}
[null,"第４号様式(第９条関係)",null,null,null,null,null,null,null,null,null,null,null,null,null,null,null,null,null,null,null,null,null,null,null,null,null,null,null,null,null,1,"←印刷したい旅行命令番号を入力してください。"]
[null,"旅行命令（依頼）簿",null,null,null,null,null,null,"旅行命令","決裁日　　　　　　年 　月 　日",null,null,null,null,null,null,null,null,null,null,"命令変更","決裁日　　　　    年   月    日"]
[null,"執行機関",null,{"$f":"基本情報登録!B1","v":"伊野中学校"},null,null,null,null,"旅行命令番号",null,null,{"$f":"AF1","v":1},null,null,null,"命令簿作成日",null,null,null,{"$f":"INDEX(入力シート!B:B,MATCH(印刷シート!$AF$1,入力シート!A:A,0))","v":"2020-06-01"},null,null,null,null,"変更簿作成日",null,null,"　　   年   月   日"]
[null,{"$f":"基本情報登録!B2","v":2},null,"年度","款",null,null,null,"項",null,null,null,null,"目",null,null,null,null,null,null,"節","09　旅費",null,null,"略科目コード"]
[null,"用務",null,{"$f":"INDEX(入力シート!C:C,MATCH(印刷シート!$AF$1,入力シート!A:A,0))&\"　（\"&INDEX(入力シート!D:D,MATCH(印刷シート!$AF$1,入力シート!A:A,0))&\"）\"","v":"テスト　（テスト2）"}]
[null,"月日","出発地",null,"経路",null,null,"到着地",null,"泊数","受命者","№","所属（住所）",null,null,"職名",null,"氏名",null,null,"種別",null,"旅費額","減額",null,null,"支給済額",null,null,"差引支給額"]
[null,null,null,null,null,null,null,null,null,null,null,1,{"$f":"基本情報登録!B1","v":"伊野中学校"},null,null,{"$f":"INDEX(基本情報登録!F:F,MATCH(R7,基本情報登録!G:G,0))","v":"校長"},null,{"$f":"INDEX(入力シート!F:F,MATCH(印刷シート!$AF$1,入力シート!A:A,0))","v":"○○　○○"}]
[null,{"$f":"IF(INDEX(入力シート!AA:AA,MATCH(印刷シート!$AF$1,入力シート!A:A,0))=\"\",\"\",INDEX(入力シート!AA:AA,MATCH(印刷シート!$AF$1,入力シート!A:A,0)))","v":"6/1"},{"$f":"IF(INDEX(入力シート!AB:AB,MATCH(印刷シート!$AF$1,入力シート!A:A,0))=\"\",\"\",INDEX(入力シート!AB:AB,MATCH(印刷シート!$AF$1,入力シート!A:A,0)))","v":"学校"},null,{"$f":"IF(INDEX(入力シート!AC:AC,MATCH(印刷シート!$AF$1,入力シート!A:A,0))=\"\",\"\",INDEX(入力シート!AC:AC,MATCH(印刷シート!$AF$1,入力シート!A:A,0)))","v":""},null,null,{"$f":"IF(INDEX(入力シート!AD:AD,MATCH(印刷シート!$AF$1,入力シート!A:A,0))=\"\",\"\",INDEX(入力シート!AD:AD,MATCH(印刷シート!$AF$1,入力シート!A:A,0)))","v":"自宅"},null,{"$f":"IF(INDEX(入力シート!AE:AE,MATCH(印刷シート!$AF$1,入力シート!A:A,0))=0,\"\",INDEX(入力シート!AE:AE,MATCH(印刷シート!$AF$1,入力シート!A:A,0)))","v":"1"},null,null,null,null,null,null,null,null,null,null,null,null,null,null,null,null,null,null,null,null,null,null,null,null,"自家用車使用申出"]
[]
[null,null,null,null,null,null,null,null,null,null,null,null,"出発地",null,"公署","・","自宅","自宅住所",null,null,null,null,"自家用車","使用申出",null,null,"摘要",null,null,null,null,null,{"$f":"INDEX(入力シート!K:K,MATCH(印刷シート!$AF$1,入力シート!A:A,0))","v":"公署"},{"$f":"IF(AG10=\"自宅\",1,0)","v":0},{"$f":"INDEX(入力シート!BO:BO,MATCH(印刷シート!$AF$1,入力シート!A:A,0))","v":"使用"}]
{"$rows_left_out":53}
{"sheet":"記入上の注意点","index":4,"n_rows":31,"n_cols":27,"rows_kept":31,"cut":false,"hidden":false,"merged":[[1,0,30,0],[0,0,0,27],[2,1,2,7],[3,1,3,2],[3,3,3,7],[3,11,3,14],[3,17,3,21],[3,24,3,27],[2,9,2,17],[2,19,2,27],[1,1,1,27],[5,1,5,2],[6,2,6,3],[6,4,6,6],[6,7,6,8],[6,10,18,10],[6,12,6,14],[8,2,8,3],[8,4,8,6],[8,7,8,8],[10,2,10,3],[7,2,7,3],[9,2,9,3],[7,4,7,6],[7,7,7,8],[9,4,9,6],[9,7,9,8],[7,11,10,11],[7,12,8,14],[10,4,10,6],[10,7,10,8],[30,11,30,17],[30,18,30,20],[30,22,30,25],[11,11,14,11],[15,11,18,11],[21,10,21,13],[25,10,25,13],[11,21,11,22],[12,21,12,22],[11,23,11,25],[15,12,15,14],[16,12,16,14],[4,5,4,7],[4,9,4,12],[4,14,4,17],[5,3,5,27],[4,19,4,21],[4,24,4,25],[6,23,6,25],[7,21,7,22],[6,26,6,27],[13,23,14,27],[7,26,7,27],[8,26,8,27],[11,26,11,27],[12,23,12,25],[12,26,12,27],[9,23,10,27],[7,23,7,25],[8,23,8,25],[6,16,6,17],[6,18,6,19],[7,15,8,15],[7,16,8,17],[6,21,6,22]]}
["　　記入上の注意点"]
[null,"第４号様式(第９条関係)"]
[null,"旅行命令（依頼）簿",null,null,null,null,null,null,"旅行命令","決裁日　　　　平成　27年 １月 13 日",null,null,null,null,null,null,null,null,"命令変更","決裁日　　平成    年   月    日"]
[null,"執行機関",null,"○○○学校",null,null,null,null,"旅行命令番号",null,null,"別途○",null,null,null,"命令簿作成日",null,"2015-01-13",null,null,null,null,"変更簿作成日",null,"　　   年   月   日"]
[null,"平成２６",null,"年度","款",null,null,null,"項",null,null,null,null,"目",null,null,null,null,"節","09　旅費",null,null,"略科目コード"]
[null,"用務",null,"○×△市学力向上推進事業に係る視察研修への出席　　　　　　　（　於：品川区教育委員会、荒川区立諏訪台中学校）"]
[null,"月日","出発地",null,"経路",null,null,"到着地",null,"泊数","受命者","Ｎo．","所属（住所）",null,null,"職名","氏名",null,"種別",null,"旅費額","減額",null,"支給済額",null,null,"差引支給額"]
[null,null,null,null,null,null,null,null,null,null,null,1,"○○○学校",null,null,"教諭","高知 太郎"]
[null,"2015-01-22","自宅",null,"東京都品川区",null,null,"東京都港区",null,1]
[null,null,null,null,null,null,null,null,null,null,null,null,"出発地　公署・自宅　　　自宅住所",null,null,null,null,null,null,null,"自家用車","使用申出",null,"摘要"]
{"$rows_left_out":22}
{"sheet":"記入例日帰り","index":5,"n_rows":31,"n_cols":27,"rows_kept":31,"cut":false,"hidden":false,"merged":[[25,10,25,13],[30,11,30,17],[30,18,30,20],[30,22,30,25],[21,2,21,3],[21,4,21,6],[21,7,21,8],[21,10,21,13],[22,2,22,3],[22,4,22,6],[17,23,18,27],[18,2,18,3],[18,4,18,6],[18,7,18,8],[15,16,16,17],[15,18,16,19],[22,7,22,8],[19,2,19,3],[19,4,19,6],[19,7,19,8],[20,2,20,3],[20,4,20,6],[20,7,20,8],[15,7,15,8],[15,11,18,11],[15,12,16,14],[15,15,16,15],[16,2,16,3],[16,4,16,6],[16,7,16,8],[16,21,16,22],[16,23,16,25],[16,26,16,27],[17,2,17,3],[12,26,12,27],[13,2,13,3],[13,4,13,6],[13,7,13,8],[13,23,14,27],[14,2,14,3],[15,21,15,22],[15,23,15,25],[15,26,15,27],[15,2,15,3],[15,4,15,6],[17,4,17,6],[17,7,17,8],[9,23,10,27],[10,2,10,3],[10,4,10,6],[10,7,10,8],[11,26,11,27],[12,2,12,3],[12,4,12,6],[12,7,12,8],[12,21,12,22],[12,23,12,25],[11,2,11,3],[11,4,11,6],[11,7,11,8],[11,11,14,11],[14,4,14,6],[14,7,14,8],[11,16,12,17],[11,18,12,19],[11,21,11,22],[11,23,11,25],[11,12,12,14],[11,15,12,15],[6,18,6,19],[6,21,6,22],[6,23,6,25],[6,26,6,27],[7,2,7,3],[7,4,7,6],[7,7,7,8],[7,11,10,11],[7,12,8,14],[7,15,8,15],[7,16,8,17],[7,18,8,19],[7,21,7,22],[7,23,7,25],[7,26,7,27],[8,2,8,3],[8,4,8,6],[8,7,8,8],[8,21,8,22],[8,23,8,25],[8,26,8,27],[9,2,9,3],[9,4,9,6],[9,7,9,8],[0,0,0,27],[1,0,30,0],[1,1,1,27],[2,1,2,7],[2,9,2,17],[2,19,2,27],[3,1,3,2],[3,3,3,7],[3,11,3,14],[3,17,3,21],[3,24,3,27],[4,5,4,7],[4,9,4,12],[4,14,4,17],[4,19,4,21],[4,24,4,25],[5,1,5,2],[5,3,5,27],[6,2,6,3],[6,4,6,6],[6,7,6,8],[6,10,18,10],[6,12,6,14],[6,16,6,17]]}
["　　記入例①　\n　　公署発自宅着の日帰り出張の場合"]
[null,"第４号様式(第９条関係)"]
[null,"旅行命令（依頼）簿",null,null,null,null,null,null,"旅行命令","決裁日　　平成２７年 １月 ２６ 日",null,null,null,null,null,null,null,null,"命令変更","決裁日　　平成    年   月    日"]
[null,"執行機関",null,"○○○学校",null,null,null,null,"旅行命令番号",null,null,"別途○",null,null,null,"命令簿作成日",null,"平成27年　１月26日",null,null,null,null,"変更簿作成日",null,"　　   年   月   日"]
[null,"平成２６",null,"年度","款",null,null,null,"項",null,null,null,null,"目",null,null,null,null,"節","09　旅費",null,null,"略科目コード"]
[null,"用務",null,"第3回○×△連絡協議会出席　　　　　　　　（於：高知会館）"]
[null,"月日","出発地",null,"経路",null,null,"到着地",null,"泊数","受命者","Ｎo．","所属（住所）",null,null,"職名","氏名",null,"種別",null,"旅費額","減額",null,"支給済額",null,null,"差引支給額"]
[null,null,null,null,null,null,null,null,null,null,null,1,"○○○学校",null,null,"教諭","高知 太郎"]
[null,"2015-02-02","学校",null,"高知市本町",null,null,"自宅"]
[null,null,null,null,null,null,null,null,null,null,null,null,"出発地　公署・自宅　　　自宅住所",null,null,null,null,null,null,null,"自家用車","使用申出",null,"摘要"]
{"$rows_left_out":22}
{"sheet":"記入例②「泊あり」","index":6,"n_rows":31,"n_cols":27,"rows_kept":31,"cut":false,"hidden":false,"merged":[[25,10,25,13],[30,11,30,17],[30,18,30,20],[30,22,30,25],[21,2,21,3],[21,4,21,6],[21,7,21,8],[21,10,21,13],[22,2,22,3],[22,4,22,6],[17,23,18,27],[18,2,18,3],[18,4,18,6],[18,7,18,8],[15,16,16,17],[15,18,16,19],[22,7,22,8],[19,2,19,3],[19,4,19,6],[19,7,19,8],[20,2,20,3],[20,4,20,6],[20,7,20,8],[15,7,15,8],[15,11,18,11],[15,12,16,14],[15,15,16,15],[16,2,16,3],[16,4,16,6],[16,7,16,8],[16,21,16,22],[16,23,16,25],[16,26,16,27],[17,2,17,3],[12,26,12,27],[13,2,13,3],[13,4,13,6],[13,7,13,8],[13,23,14,27],[14,2,14,3],[15,21,15,22],[15,23,15,25],[15,26,15,27],[15,2,15,3],[15,4,15,6],[17,4,17,6],[17,7,17,8],[9,23,10,27],[10,2,10,3],[10,4,10,6],[10,7,10,8],[11,26,11,27],[12,2,12,3],[12,4,12,6],[12,7,12,8],[12,21,12,22],[12,23,12,25],[11,2,11,3],[11,4,11,6],[11,7,11,8],[11,11,14,11],[14,4,14,6],[14,7,14,8],[11,16,12,17],[11,18,12,19],[11,21,11,22],[11,23,11,25],[11,12,12,14],[11,15,12,15],[6,18,6,19],[6,21,6,22],[6,23,6,25],[6,26,6,27],[7,2,7,3],[7,4,7,6],[7,7,7,8],[7,11,10,11],[7,12,8,14],[7,15,8,15],[7,16,8,17],[7,18,8,19],[7,21,7,22],[7,23,7,25],[7,26,7,27],[8,2,8,3],[8,4,8,6],[8,7,8,8],[8,21,8,22],[8,23,8,25],[8,26,8,27],[9,2,9,3],[9,4,9,6],[9,7,9,8],[0,0,0,27],[1,0,30,0],[1,1,1,27],[2,1,2,7],[2,9,2,17],[2,19,2,27],[3,1,3,2],[3,3,3,7],[3,11,3,14],[3,17,3,21],[3,24,3,27],[4,5,4,7],[4,9,4,12],[4,14,4,17],[4,19,4,21],[4,24,4,25],[5,1,5,2],[5,3,5,27],[6,2,6,3],[6,4,6,6],[6,7,6,8],[6,10,18,10],[6,12,6,14],[6,16,6,17]]}
["　　記入例②　\n　　泊をともなう出張の場合"]
[null,"第４号様式(第９条関係)"]
[null,"旅行命令（依頼）簿",null,null,null,null,null,null,"旅行命令","決裁日　　平成２７年 １月 ２６ 日",null,null,null,null,null,null,null,null,"命令変更","決裁日　　平成    年   月    日"]
[null,"執行機関",null,"○○○学校",null,null,null,null,"旅行命令番号",null,null,"別途○",null,null,null,"命令簿作成日",null,"平成27年　１月26日",null,null,null,null,"変更簿作成日",null,"　　   年   月   日"]
[null,"平成２６",null,"年度","款",null,null,null,"項",null,null,null,null,"目",null,null,null,null,"節","09　旅費",null,null,"略科目コード"]
[null,"用務",null,"大阪市立○○学校研究指定校発表会参加　　　　　　　　（大阪市立○○学校）"]
[null,"月日","出発地",null,"経路",null,null,"到着地",null,"泊数","受命者","Ｎo．","所属（住所）",null,null,"職名","氏名",null,"種別",null,"旅費額","減額",null,"支給済額",null,null,"差引支給額"]
[null,null,null,null,null,null,null,null,null,null,null,1,"○○○学校",null,null,"教諭","高知 太郎"]
[null,"2015-02-02","自宅",null,null,null,null,"大阪府大阪市",null,1]
[null,null,null,null,null,null,null,null,null,null,null,null,"出発地　公署・自宅　　　自宅住所",null,null,null,null,null,null,null,"自家用車","使用申出",null,"摘要"]
{"$rows_left_out":22}
{"sheet":"記入例③「ゆとり出張」","index":7,"n_rows":31,"n_cols":27,"rows_kept":31,"cut":false,"hidden":false,"merged":[[12,26,12,27],[9,23,10,27],[13,23,14,27],[17,23,18,27],[12,23,12,25],[11,26,11,27],[8,26,8,27],[11,23,11,25],[1,1,1,27],[15,21,15,22],[15,23,15,25],[15,26,15,27],[16,21,16,22],[16,23,16,25],[16,26,16,27],[6,21,6,22],[6,23,6,25],[6,26,6,27],[7,23,7,25],[8,23,8,25],[7,26,7,27],[5,1,5,2],[6,2,6,3],[6,4,6,6],[7,21,7,22],[8,21,8,22],[15,12,16,14],[15,15,16,15],[15,16,16,17],[15,18,16,19],[11,21,11,22],[12,21,12,22],[18,2,18,3],[18,4,18,6],[18,7,18,8],[15,7,15,8],[16,2,16,3],[16,4,16,6],[16,7,16,8],[17,2,17,3],[17,4,17,6],[17,7,17,8],[30,22,30,25],[4,5,4,7],[4,9,4,12],[4,14,4,17],[4,19,4,21],[4,24,4,25],[5,3,5,27],[7,2,7,3],[7,4,7,6],[7,7,7,8],[9,2,9,3],[9,4,9,6],[9,7,9,8],[11,2,11,3],[11,4,11,6],[11,7,11,8],[10,4,10,6],[10,7,10,8],[12,2,12,3],[12,4,12,6],[12,7,12,8],[13,2,13,3],[13,4,13,6],[13,7,13,8],[6,16,6,17],[6,18,6,19],[11,12,12,14],[11,15,12,15],[11,16,12,17],[11,18,12,19],[30,11,30,17],[30,18,30,20],[7,11,10,11],[7,12,8,14],[7,15,8,15],[7,16,8,17],[7,18,8,19],[21,10,21,13],[25,10,25,13],[21,2,21,3],[21,4,21,6],[21,7,21,8],[22,2,22,3],[22,4,22,6],[22,7,22,8],[19,2,19,3],[19,4,19,6],[19,7,19,8],[20,2,20,3],[20,4,20,6],[20,7,20,8],[0,0,0,27],[2,1,2,7],[3,1,3,2],[3,3,3,7],[3,11,3,14],[3,17,3,21],[3,24,3,27],[2,9,2,17],[2,19,2,27],[1,0,30,0],[6,7,6,8],[6,10,18,10],[6,12,6,14],[8,2,8,3],[8,4,8,6],[8,7,8,8],[10,2,10,3],[11,11,14,11],[15,11,18,11],[14,2,14,3],[14,4,14,6],[14,7,14,8],[15,2,15,3],[15,4,15,6]]}
["　　記入例③　\n　　ゆとり出張の場合"]
[null,"第４号様式(第９条関係)"]
[null,"旅行命令（依頼）簿",null,null,null,null,null,null,"旅行命令","決裁日　　平成２６年 １２月 ５ 日",null,null,null,null,null,null,null,null,"命令変更","決裁日　　平成    年   月    日"]
[null,"執行機関",null,"○○○学校",null,null,null,null,"旅行命令番号",null,null,"別途○",null,null,null,"命令簿作成日",null,"2014-12-05",null,null,null,null,"変更簿作成日",null,"　　   年   月   日"]
[null,"平成２６",null,"年度","款",null,null,null,"項",null,null,null,null,"目",null,null,null,null,"節","09　旅費",null,null,"略科目コード"]
[null,"用務",null,"○○研究大会横浜大会参加　　　　　　　　（パシフィコ横浜）"]
[null,"月日","出発地",null,"経路",null,null,"到着地",null,"泊数","受命者","Ｎo．","所属（住所）",null,null,"職名","氏名",null,"種別",null,"旅費額","減額",null,"支給済額",null,null,"差引支給額"]
[null,null,null,null,null,null,null,null,null,null,null,1,"○○○学校",null,null,"教諭","高知 太郎"]
[null,"2014-12-12","自宅",null,"神奈川県横浜市",null,null,"自宅"]
[null,null,null,null,null,null,null,null,null,null,null,null,"出発地　公署・自宅　　　自宅住所",null,null,null,null,null,null,null,"自家用車","使用申出",null,"摘要"]
{"$rows_left_out":22}
{"sheet":"記入例④「変更」","index":8,"n_rows":31,"n_cols":27,"rows_kept":31,"cut":false,"hidden":false,"merged":[[3,24,3,27],[4,5,4,7],[4,9,4,12],[4,14,4,17],[4,19,4,21],[4,24,4,25],[0,0,0,27],[1,0,30,0],[1,1,1,27],[2,1,2,7],[2,9,2,17],[2,19,2,27],[3,1,3,2],[3,3,3,7],[3,11,3,14],[3,17,3,21],[5,1,5,2],[5,3,5,27],[6,2,6,3],[6,4,6,6],[6,7,6,8],[6,10,18,10],[6,12,6,14],[6,16,6,17],[6,18,6,19],[6,21,6,22],[6,23,6,25],[6,26,6,27],[7,2,7,3],[7,4,7,6],[7,7,7,8],[7,11,10,11],[7,12,8,14],[7,15,8,15],[7,16,8,17],[7,18,8,19],[7,21,7,22],[7,23,7,25],[7,26,7,27],[8,2,8,3],[8,4,8,6],[8,7,8,8],[8,21,8,22],[8,23,8,25],[8,26,8,27],[12,21,12,22],[12,23,12,25],[11,2,11,3],[11,4,11,6],[11,7,11,8],[11,11,14,11],[9,2,9,3],[9,4,9,6],[9,7,9,8],[9,23,10,27],[10,2,10,3],[10,4,10,6],[10,7,10,8],[15,2,15,3],[15,4,15,6],[15,7,15,8],[15,11,18,11],[15,12,16,14],[15,15,16,15],[12,26,12,27],[13,2,13,3],[13,4,13,6],[13,7,13,8],[13,23,14,27],[14,2,14,3],[14,4,14,6],[14,7,14,8],[11,16,12,17],[11,18,12,19],[11,21,11,22],[11,23,11,25],[11,12,12,14],[11,15,12,15],[11,26,11,27],[12,2,12,3],[12,4,12,6],[12,7,12,8],[19,2,19,3],[19,4,19,6],[19,7,19,8],[20,2,20,3],[20,4,20,6],[20,7,20,8],[16,26,16,27],[17,2,17,3],[17,4,17,6],[17,7,17,8],[17,23,18,27],[18,2,18,3],[18,4,18,6],[18,7,18,8],[15,16,16,17],[15,18,16,19],[15,21,15,22],[15,23,15,25],[15,26,15,27],[16,2,16,3],[16,4,16,6],[16,7,16,8],[16,21,16,22],[16,23,16,25],[25,10,25,13],[30,11,30,17],[30,18,30,20],[30,22,30,25],[21,2,21,3],[21,4,21,6],[21,7,21,8],[21,10,21,13],[22,2,22,3],[22,4,22,6],[22,7,22,8]]}
["　　記入例④　\n　　変更があった場合"]
[null,"第４号様式(第９条関係)"]
[null,"旅行命令（依頼）簿",null,null,null,null,null,null,"旅行命令","決裁日　　平成２７年 １月 ２６ 日",null,null,null,null,null,null,null,null,"命令変更","決裁日　　平成２７年 ２月 １ 日"]
[null,"執行機関",null,"○○○学校",null,null,null,null,"旅行命令番号",null,null,"別途○",null,null,null,"命令簿作成日",null,"平成27年　１月26日",null,null,null,null,"変更簿作成日",null,"平成27年２月１日"]
[null,"平成２６",null,"年度","款",null,null,null,"項",null,null,null,null,"目",null,null,null,null,"節","09　旅費",null,null,"略科目コード"]
[null,"用務",null,"第3回○×△連絡協議会出席　　　　　　　　（高知会館）"]
[null,"月日","出発地",null,"経路",null,null,"到着地",null,"泊数","受命者","Ｎo．","所属（住所）",null,null,"職名","氏名",null,"種別",null,"旅費額","減額",null,"支給済額",null,null,"差引支給額"]
[null,"2015-02-13",null,null,null,null,null,null,null,null,null,1,"○○○学校",null,null,"教諭","高知 太郎"]
[null,"2015-02-02","学校",null,"高知市本町",null,null,"自宅"]
[null,null,null,null,null,null,null,null,null,null,null,null,"出発地　公署・自宅　　　自宅住所",null,null,null,null,null,null,null,"自家用車","使用申出",null,"摘要"]
{"$rows_left_out":22}
{"sheet":"記入例⑤「取り止め」","index":9,"n_rows":31,"n_cols":27,"rows_kept":31,"cut":false,"hidden":false,"merged":[[3,24,3,27],[4,5,4,7],[4,9,4,12],[4,14,4,17],[4,19,4,21],[4,24,4,25],[0,0,0,27],[1,0,30,0],[1,1,1,27],[2,1,2,7],[2,9,2,17],[2,19,2,27],[3,1,3,2],[3,3,3,7],[3,11,3,14],[3,17,3,21],[5,1,5,2],[5,3,5,27],[6,2,6,3],[6,4,6,6],[6,7,6,8],[6,10,18,10],[6,12,6,14],[6,16,6,17],[6,18,6,19],[6,21,6,22],[6,23,6,25],[6,26,6,27],[7,2,7,3],[7,4,7,6],[7,7,7,8],[7,11,10,11],[7,12,8,14],[7,15,8,15],[7,16,8,17],[7,18,8,19],[7,21,7,22],[7,23,7,25],[7,26,7,27],[8,2,8,3],[8,4,8,6],[8,7,8,8],[8,21,8,22],[8,23,8,25],[8,26,8,27],[12,21,12,22],[12,23,12,25],[11,2,11,3],[11,4,11,6],[11,7,11,8],[11,11,14,11],[9,2,9,3],[9,4,9,6],[9,7,9,8],[9,23,10,27],[10,2,10,3],[10,4,10,6],[10,7,10,8],[15,2,15,3],[15,4,15,6],[15,7,15,8],[15,11,18,11],[15,12,16,14],[15,15,16,15],[12,26,12,27],[13,2,13,3],[13,4,13,6],[13,7,13,8],[13,23,14,27],[14,2,14,3],[14,4,14,6],[14,7,14,8],[11,16,12,17],[11,18,12,19],[11,21,11,22],[11,23,11,25],[11,12,12,14],[11,15,12,15],[11,26,11,27],[12,2,12,3],[12,4,12,6],[12,7,12,8],[19,2,19,3],[19,4,19,6],[19,7,19,8],[20,2,20,3],[20,4,20,6],[20,7,20,8],[16,26,16,27],[17,2,17,3],[17,4,17,6],[17,7,17,8],[17,23,18,27],[18,2,18,3],[18,4,18,6],[18,7,18,8],[15,16,16,17],[15,18,16,19],[15,21,15,22],[15,23,15,25],[15,26,15,27],[16,2,16,3],[16,4,16,6],[16,7,16,8],[16,21,16,22],[16,23,16,25],[25,10,25,13],[30,11,30,17],[30,18,30,20],[30,22,30,25],[21,2,21,3],[21,4,21,6],[21,7,21,8],[21,10,21,13],[22,2,22,3],[22,4,22,6],[22,7,22,8]]}
["　　記入例⑤　\n　　取り止めがあった場合"]
[null,"第４号様式(第９条関係)"]
[null,"旅行命令（依頼）簿",null,null,null,null,null,null,"旅行命令","決裁日　　平成２７年 １月 ２６ 日",null,null,null,null,null,null,null,null,"命令変更","決裁日　　平成２７年 ２月 ２ 日"]
[null,"執行機関",null,"○○○学校",null,null,null,null,"旅行命令番号",null,null,"別途○",null,null,null,"命令簿作成日",null,"平成27年　１月26日",null,null,null,null,"変更簿作成日",null,"平成27年２月２日"]
[null,"平成２６",null,"年度","款",null,null,null,"項",null,null,null,null,"目",null,null,null,null,"節","09　旅費",null,null,"略科目コード"]
[null,"用務",null,"第3回○×△連絡協議会出席　　　　　　　　（高知会館）"]
[null,"月日","出発地",null,"経路",null,null,"到着地",null,"泊数","受命者","Ｎo．","所属（住所）",null,null,"職名","氏名",null,"種別",null,"旅費額","減額",null,"支給済額",null,null,"差引支給額"]
[null,null,null,null,null,null,null,null,null,null,null,1,"○○○学校",null,null,"教諭","高知 太郎"]
[null,"2015-02-02","学校",null,"高知市本町",null,null,"自宅"]
[null,null,null,null,null,null,null,null,null,null,null,null,"出発地　公署・自宅　　　自宅住所",null,null,null,null,null,null,null,"自家用車","使用申出",null,"摘要"]
{"$rows_left_out":21}